NO,����,����_�J�i,�Z��,����,�ܓx,�o�x,�W��,�d�b�ԍ�,�����ԍ�,�s�撬���R�[�h,�s���{����,�s�撬����,�ЊQ���_�^��,�ЊQ���_�R����A�y�Η��y�ђn����,�ЊQ���_����,�ЊQ���_�n�k,�ЊQ���_�Ôg,�ЊQ���_��K�͂ȉΎ�,�ЊQ���_�����×�,�ЊQ���_�ΎR����,�w����Ƃ̏d��,�z����e�l��,�ΏۂƂȂ钬��E������,URL,���l
1,������ꏬ�w�Z�O���E���h,�`���E���E�_�C�C�`�V���E�K�b�R�E�O���E���h,�R�`���߉��s������2-1,,,,,(0235)22-0441,,062031,�R�`��,�߉��s,,,,1,,1,,,1,"4,050�l�i2�������[�g��������1�l�j",���w��,,
2,�߉���O���w�Z�O���E���h,�c���I�J�_�C�T���`���E�K�b�R�E�O���E���h,�R�`���߉��s��쒬25-1,,,,,(0235)22-2793,,062031,�R�`��,�߉��s,,,,1,,1,,,1,"3,800�l�i2�������[�g��������1�l�j",���w��,,
3,�_�y������,�J�O���o�V�R�E�G��,�R�`���߉��s�O����3,,,,,,,062031,�R�`��,�߉��s,,,,1,,1,,,,450�l�i2�������[�g��������1�l�j,���w��,,
4,�암����,�i���u�R�E�G��,�R�`���߉��s�r��5-37,,,,,,,062031,�R�`��,�߉��s,,,,1,,1,,,,650�l�i2�������[�g��������1�l�j,���w��,,
5,��O��,�W���E�l���W,�R�`���߉��s�r��1-1,,,,,,,062031,�R�`��,�߉��s,,,,1,,1,,,,"1,020�l�i2�������[�g��������1�l�j",���w��,,
6,���Ғ�������,�`���E�W���}�`�q�K�V�R�E�G��,�R�`���߉��s���Ғ�26-10,,,,,,,062031,�R�`��,�߉��s,,,,1,,1,,,,650�l�i2�������[�g��������1�l�j,���w��,,
7,���Ғ�������,�`���E�W���}�`�j�V�R�E�G��,�R�`���߉��s���Ғ�20-1,,,,,,,062031,�R�`��,�߉��s,,,,1,,1,,,,750�l�i2�������[�g��������1�l�j,���w��,,
8,�߉��s�㉺������,�c���I�J�V�W���E�Q�X�C�h�E�u,�R�`���߉��s�̂��ݒ�2-10,,,,,(0235)23-7731,,062031,�R�`��,�߉��s,,,,1,,1,,,,"3,750�l�i2�������[�g��������1�l�j",���w��,,
9,�߉����w��,�c���I�J�W���E�i���K�N�G��,�R�`���߉��s�̂��ݒ�6-20,,,,,(0235)24-7164,,062031,�R�`��,�߉��s,,,,1,,1,,,,500�l�i2�������[�g��������1�l�j,���w��,,
10,���񂪂�����,�I���K�����R�E�G��,�R�`���߉��s�̂��ݒ�10-3,,,,,,,062031,�R�`��,�߉��s,,,,1,,1,,,,"1,250�l�i2�������[�g��������1�l�j",���w��,,
11,���}�_��,�q�G�W���W��,�R�`���߉��s���}����{3,,,,,,,062031,�R�`��,�߉��s,,,,1,,1,,,,300�l�i2�������[�g��������1�l�j,���w��,,
12,��쒬����,�W���E�i���}�`�R�E�G��,�R�`���߉��s��쒬10-1,,,,,,,062031,�R�`��,�߉��s,,,,1,,1,,,,850�l�i2�������[�g��������1�l�j,���w��,,
13,��쐼����,�W���E�i���j�V�R�E�G��,�R�`���߉��s��쒬37-8,,,,,,,062031,�R�`��,�߉��s,,,,1,,1,,,,"1,000�l�i2�������[�g��������1�l�j",���w��,,
14,�O��������,�T���R�E�`���E�R�E�G��,�R�`���߉��s�O����9-31,,,,,,,062031,�R�`��,�߉��s,,,,1,,1,,,,250�l�i2�������[�g��������1�l�j,���w��,,
15,����������,�t�~�]�m�}�`�R�E�G��,�R�`���߉��s������14-11,,,,,,,062031,�R�`��,�߉��s,,,,1,,1,,,,900�l�i2�������[�g��������1�l�j,���w��,,
16,�{���񒚖ڍL��,�z���`���E�j�`���E���q���o,�R�`���߉��s�{��2-4-2,,,,,,,062031,�R�`��,�߉��s,,,,1,,1,,,,801�l�i2�������[�g��������1�l�j,���w��,,
17,�߉��s����������,�c���I�J�V�`���E�I�E�W�h�E�J��,�R�`���߉��s�c�Ò�1-1,,,,,(0235)24-4608,,062031,�R�`��,�߉��s,,,,1,,1,,,,"7,500�l�i2�������[�g��������1�l�j",���w��,,
18,��������,�g�E�u�R�E�G��,�R�`���߉��s�哌��6-58,,,,,,,062031,�R�`��,�߉��s,,,,1,,1,,,,850�l�i2�������[�g��������1�l�j,���w��,,
19,�������,�u�^�C�R�E�G��,�R�`���߉��s�_����15-32,,,,,,,062031,�R�`��,�߉��s,,,,1,,1,,,,"1,650�l�i2�������[�g��������1�l�j",���w��,,
20,�߉��V���{,�c���I�J�e���}���O�E,�R�`���߉��s�_����3-40,,,,,(0235)22-3952,,062031,�R�`��,�߉��s,,,,1,,1,,,,"1,800�l�i2�������[�g��������1�l�j",���w��,,
21,�t���_��,�J�X�K�W���W��,�R�`���߉��s�_����9-5,,,,,(0235)22-3952,,062031,�R�`��,�߉��s,,,,1,,1,,,,"1,250�l�i2�������[�g��������1�l�j",���w��,,
22,���̏o����,�q�m�f�R�E�G��,�R�`���߉��s���o1-23-1,,,,,,,062031,�R�`��,�߉��s,,,,1,,1,,,,750�l�i2�������[�g��������1�l�j,���w��,,
23,�����^������,�g�E�u�E���h�E�R�E�G��,�R�`���߉��s�ɐ�����12-13,,,,,,,062031,�R�`��,�߉��s,,,,1,,1,,,,"4,900�l�i2�������[�g��������1�l�j",���w��,,
24,�ӂꂠ������,�t���A�C�R�E�G��,�R�`���߉��s�ɐ�����7-1,,,,,,,062031,�R�`��,�߉��s,,,,1,,1,,,,"1,000�l�i2�������[�g��������1�l�j",���w��,,
25,�����Ђ�������,�I�I�q�K�V�R�E�G��,�R�`���߉��s������4-6,,,,,,,062031,�R�`��,�߉��s,,,,1,,1,,,,600�l�i2�������[�g��������1�l�j,���w��,,
26,�r�c����,�A���^�R�E�G��,�R�`���߉��s���o2-11-1,,,,,,,062031,�R�`��,�߉��s,,,,1,,1,,,,400�l�i2�������[�g��������1�l�j,���w��,,
27,������񏬊w�Z�O���E���h,�`���E���E�_�C�j�V���E�K�b�R�E�O���E���h,�R�`���߉��s������25-1,,,,,(0235)22-7755,,062031,�R�`��,�߉��s,,,,1,,1,,,1,"3,750�l�i2�������[�g��������1�l�j",���w��,,
28,�ӂ�������,�t�W�����R�E�G��,�R�`���߉��s���V��4-22,,,,,,,062031,�R�`��,�߉��s,,,,1,,1,,,,800�l�i2�������[�g��������1�l�j,���w��,,
29,����������,���c�R�E���R�E�G��,�R�`���߉��s�قȂݒ�13-1,,,,,,,062031,�R�`��,�߉��s,,,,1,,1,,,,800�l�i2�������[�g��������1�l�j,���w��,,
30,�߉��암����,�c���I�J�i���u�R�E�G��,�R�`���߉��s�قȂݒ�4,,,,,,,062031,�R�`��,�߉��s,,,,1,,1,,,,"2,550�l�i2�������[�g��������1�l�j",���w��,,
31,�������,���T�J�R�E�G��,�R�`���߉��s�哌��24-18,,,,,,,062031,�R�`��,�߉��s,,,,1,,1,,,,600�l�i2�������[�g��������1�l�j,���w��,,
32,�݂�������,�~�Y�L�R�E�G��,�R�`���߉��s�ɐ�����24-1,,,,,,,062031,�R�`��,�߉��s,,,,1,,1,,,,"1,000�l�i2�������[�g��������1�l�j",���w��,,
33,�ɐ���������,�C�Z���R�E�`�R�E�G��,�R�`���߉��s�ɐ�����18-2,,,,,,,062031,�R�`��,�߉��s,,,,1,,1,,,,"1,400�l�i2�������[�g��������1�l�j",���w��,,
34,�V�`������,�j�C�K�^�q�K�V�R�E�G��,�R�`���߉��s�V�`��19-3,,,,,,,062031,�R�`��,�߉��s,,,,1,,1,,,,350�l�i2�������[�g��������1�l�j,��O�w��,,
35,�߉�����,�c���I�J�R�E�G��,�R�`���߉��s�n�꒬4-4,,,,,,,062031,�R�`��,�߉��s,,,,1,,1,,,,"16,500�l�i2�������[�g��������1�l�j",��O�w��,,
36,������O���w�Z�O���E���h,�`���E���E�_�C�T���V���E�K�b�R�E�O���E���h,�R�`���߉��s�V�`��17-24,,,,,(0235)22-0318,,062031,�R�`��,�߉��s,,,,1,,1,,,1,"3,000�l�i2�������[�g��������1�l�j",��O�w��,,
37,�߉��k�����w�Z�O���E���h,�c���I�J�L�^�R�E�g�E�K�b�R�E�O���E���h,�R�`���߉��s��t��16-5,,,,,(0235)25-4752,,062031,�R�`��,�߉��s,,,,1,,1,,,1,"3,750�l�i2�������[�g��������1�l�j",��O�w��,,
38,���������w�Z���p�O���E���h,�P�����c�R�E�g�E�K�b�R�E�L���E���E�O���E���h,�R�`���߉��s�V�`��2-62,,,,,,,062031,�R�`��,�߉��s,,,,1,,1,,,,"10,350�l�i2�������[�g��������1�l�j",��O�w��,,
39,�߉��썂���w�Z�O���E���h,�c���I�J�~�i�~�R�E�g�E�K�b�R�E�O���E���h,�R�`���߉��s��t��26-31,,,,,(0235)22-0061,,062031,�R�`��,�߉��s,,,,1,,1,,,1,"6,300�l�i2�������[�g��������1�l�j",��O�w��,,
40,�߉��H�ƍ����w�Z�O���E���h,�c���I�J�R�E�M���E�R�E�g�E�K�b�R�E�O���E���h,�R�`���߉��s�ƒ��V��8-1,,,,,(0235)22-5505,,062031,�R�`��,�߉��s,,,,1,,1,,,1,"8,050�l�i2�������[�g��������1�l�j",��O�w��,,
41,�߉����������w�Z�O���E���h,�c���I�J�`���E�I�E�R�E�g�E�K�b�R�E�O���E���h,�R�`���߉��s��󎛎����{��410,,,,,(0235)25-5724,,062031,�R�`��,�߉��s,,,,1,,1,,,,"17,850�l�i2�������[�g��������1�l�j",��O�w��,,
42,�R�`��w�_�w���O���E���h,���}�K�^�_�C�K�N�m�E�K�N�u�O���E���h,�R�`���߉��s�V�`��1-23,,,,,(0235)28-2845,,062031,�R�`��,�߉��s,,,,1,,1,,,1,"4,900�l�i2�������[�g��������1�l�j",��O�w��,,
43,�ђ�����,�j�V�L�}�`�R�E�G��,�R�`���߉��s�ђ�9-3,,,,,,,062031,�R�`��,�߉��s,,,,1,,1,,,,"1,250�l�i2�������[�g��������1�l�j",��O�w��,,
44,�V�`����,�j�C�K�^�R�E�G��,�R�`���߉��s�V�`��23-26,,,,,,,062031,�R�`��,�߉��s,,,,1,,1,,,,500�l�i2�������[�g��������1�l�j,��O�w��,,
45,���}�_��,�q�G�W���W��,�R�`���߉��s�R����2-69,,,,,,,062031,�R�`��,�߉��s,,,,1,,1,,,,"3,950�l�i2�������[�g��������1�l�j",��O�w��,,
46,�Ƃ�̂�����,�g���m�X�R�E�G��,�R�`���߉��s��k��1-32,,,,,,,062031,�R�`��,�߉��s,,,,1,,1,,,,950�l�i2�������[�g��������1�l�j,��O�w��,,
47,�啔����,�_�C�u�R�E�G��,�R�`���߉��s�啔��18-6,,,,,,,062031,�R�`��,�߉��s,,,,1,,1,,,,"2,600�l�i2�������[�g��������1�l�j",��O�w��,,
48,�V�`�k����,�j�C�K�^�L�^�R�E�G��,�R�`���߉��s�V�`��7-154,,,,,,,062031,�R�`��,�߉��s,,,,1,,1,,,,850�l�i2�������[�g��������1�l�j,��O�w��,,
49,���a�c����,�q�����_�R�E�G��,�R�`���߉��s���a�c��15-5,,,,,,,062031,�R�`��,�߉��s,,,,1,,1,,,,750�l�i2�������[�g��������1�l�j,��O�w��,,
50,����͐�Βn,�E�`�J���J�Z�������N�`,�R�`���߉��s��9-1,,,,,,,062031,�R�`��,�߉��s,,,,1,,1,,,,"10,300�l�i2�������[�g��������1�l�j",��O�w��,,
51,�₷�炬����,���X���M�R�E�G��,�R�`���߉��s������24-1,,,,,,,062031,�R�`��,�߉��s,,,,1,,1,,,,750�l�i2�������[�g��������1�l�j,��O�w��,,
52,��������,�`�����R�E�G��,�R�`���߉��s������12-13,,,,,,,062031,�R�`��,�߉��s,,,,1,,1,,,,600�l�i2�������[�g��������1�l�j,��O�w��,,
53,������l���w�Z�O���E���h,�`���E���E�_�C�����V���E�K�b�R�E�O���E���h,�R�`���߉��s���c���c��28-1,,,,,(0235)22-8643,,062031,�R�`��,�߉��s,,,,1,,1,,,1,"4,000�l�i2�������[�g��������1�l�j",��l�w��,,
54,�߉���l���w�Z�O���E���h,�c���I�J�_�C�����`���E�K�b�R�E�O���E���h,�R�`���߉��s���^�،���3-23,,,,,(0235)24-7330,,062031,�R�`��,�߉��s,,,,1,,1,,,1,"3,200�l�i2�������[�g��������1�l�j",��l�w��,,
55,�߉������{��w�Z�O���E���h,�c���I�J�R�E�g�E���E�S�K�b�R�E�O���E���h,�R�`���߉��s�1-20-33,,,,,(0235)22-0581,,062031,�R�`��,�߉��s,,,,1,,1,,,1,"3,950�l�i2�������[�g��������1�l�j",��l�w��,,
56,���^�،�����,�R�}�M�n���R�E�G��,�R�`���߉��s���^�،���2-102,,,,,,,062031,�R�`��,�߉��s,,,,1,,1,,,,"90,000�l�i2�������[�g��������1�l�j",��l�w��,,
57,����������,�~�n���}�`�R�E�G��,�R�`���߉��s������26-24,,,,,,,062031,�R�`��,�߉��s,,,,1,,1,,,,850�l�i2�������[�g��������1�l�j,��l�w��,,
58,�k�c����,�L�^�_�R�E�G��,�R�`���߉��s�2-1-20,,,,,,,062031,�R�`��,�߉��s,,,,1,,1,,,,950�l�i2�������[�g��������1�l�j,��l�w��,,
59,��������,�A�I���M�`���E�R�E�G��,�R�`���߉��s����2-6,,,,,,,062031,�R�`��,�߉��s,,,,1,,1,,,,450�l�i2�������[�g��������1�l�j,��l�w��,,
60,�����킢����,�T�C���C�R�E�G��,�R�`���߉��s����24-1,,,,,,,062031,�R�`��,�߉��s,,,,1,,1,,,,650�l�i2�������[�g��������1�l�j,��l�w��,,
61,�암�ۈ牀��,�i���u�z�C�N�G���e�C,�R�`���߉��s������13-10,,,,,(0235)22-0527,,062031,�R�`��,�߉��s,,,,1,,1,,,,"1,050�l�i2�������[�g��������1�l�j",��l�w��,,
62,�߉���񒆊w�Z�O���E���h,�c���I�J�_�C�j�`���E�K�b�R�E�O���E���h,�R�`���߉��s��c2-8-2,,,,,(0235)22-8323,,062031,�R�`��,�߉��s,,,,1,,1,,,1,"5,500�l�i2�������[�g��������1�l�j",��܊w��,,
63,������܏��w�Z�O���E���h,�`���E���E�_�C�S�V���E�K�b�R�E�O���E���h,�R�`���߉��s�ؓY��15-2,,,,,(0235)22-0514,,062031,�R�`��,�߉��s,,,,1,,1,,,1,"5,000�l�i2�������[�g��������1�l�j",��܊w��,,
64,���`����,�h�E�K�^�R�E�G��,�R�`���߉��s���`��22-2,,,,,,,062031,�R�`��,�߉��s,,,,1,,1,,,,"1,000�l�i2�������[�g��������1�l�j",��܊w��,,
65,�w�O����,�G�L�}�G�R�E�G��,�R�`���߉��s���L��17-4,,,,,,,062031,�R�`��,�߉��s,,,,1,,1,,,,700�l�i2�������[�g��������1�l�j,��܊w��,,
66,���̎q����,�X�M�m�R�R�E�G��,�R�`���߉��s������14-4,,,,,,,062031,�R�`��,�߉��s,,,,1,,1,,,,"1,200�l�i2�������[�g��������1�l�j",��܊w��,,
67,�������k����,�g���C�}�`�L�^�R�E�G��,�R�`���߉��s������4-1,,,,,,,062031,�R�`��,�߉��s,,,,1,,1,,,,650�l�i2�������[�g��������1�l�j,��܊w��,,
68,�����������,�g���C�}�`�~�i�~�R�E�G��,�R�`���߉��s������26-1,,,,,,,062031,�R�`��,�߉��s,,,,1,,1,,,,650�l�i2�������[�g��������1�l�j,��܊w��,,
69,���g������,�q���V�}�`�R�E�G��,�R�`���߉��s���g��9-120,,,,,,,062031,�R�`��,�߉��s,,,,1,,1,,,,750�l�i2�������[�g��������1�l�j,��܊w��,,
70,�󒬌���,�^�J���}�`�R�E�G��,�R�`���߉��s��8-8,,,,,,,062031,�R�`��,�߉��s,,,,1,,1,,,,"1,300�l�i2�������[�g��������1�l�j",��܊w��,,
71,�D�n����,�t�i�g�R�E�G��,�R�`���߉��s������13,,,,,,,062031,�R�`��,�߉��s,,,,1,,1,,,,650�l�i2�������[�g��������1�l�j,��܊w��,,
72,�߉�������,�c���I�J�q�K�V�R�E�G��,�R�`���߉��s������21,,,,,,,062031,�R�`��,�߉��s,,,,1,,1,,,,"5,000�l�i2�������[�g��������1�l�j",��܊w��,,
73,���n����,�_�C�z�E�W�R�E�G��,�R�`���߉��s��󎛒�19-1,,,,,,,062031,�R�`��,�߉��s,,,,1,,1,,,,450�l�i2�������[�g��������1�l�j,��܊w��,,
74,���c�t��,�_�C�z�E���E�`�G��,�R�`���߉��s��󎛒�14-9,,,,,(0235)22-1883,,062031,�R�`��,�߉��s,,,,1,,1,,,,700�l�i2�������[�g��������1�l�j,��܊w��,,
75,������Z���w�Z�O���E���h,�`���E���E�_�C���N�V���E�K�b�R�E�O���E���h,�R�`���߉��s���쒬9-7,,,,,(0235)24-2290,,062031,�R�`��,�߉��s,,,,1,,1,,,1,"4,950�l�i2�������[�g��������1�l�j",��Z�w��,,
76,�߉���ꒆ�w�Z�O���E���h,�c���I�J�_�C�C�`�`���E�K�b�R�E�O���E���h,�R�`���߉��s���c��1-26,,,,,(0235)22-0530,,062031,�R�`��,�߉��s,,,,1,,1,,,1,"5,800�l�i2�������[�g��������1�l�j",��Z�w��,,
77,�߉��{��w�Z�O���E���h,�c���I�J���E�S�K�b�R�E�O���E���h,�R�`���߉��s��˒�5-44,,,,,(0235)24-5959,,062031,�R�`��,�߉��s,,,,1,,1,,,1,"5,000�l�i2�������[�g��������1�l�j",��Z�w��,,
78,���c����,�~�`�_�R�E�G��,�R�`���߉��s���c��22-1,,,,,,,062031,�R�`��,�߉��s,,,,1,,1,,,,900�l�i2�������[�g��������1�l�j,��Z�w��,,
79,��ˌ���,�I�I�c�J�R�E�G��,�R�`���߉��s��˒�20-8,,,,,,,062031,�R�`��,�߉��s,,,,1,,1,,,,"1,300�l�i2�������[�g��������1�l�j",��Z�w��,,
80,�݂ǂ蒬����,�~�h���}�`�R�E�G��,�R�`���߉��s�݂ǂ蒬30-6,,,,,,,062031,�R�`��,�߉��s,,,,1,,1,,,,750�l�i2�������[�g��������1�l�j,��Z�w��,,
81,�V������,�V���}�`�R�E�G��,�R�`���߉��s�V�C��29-90,,,,,,,062031,�R�`��,�߉��s,,,,1,,1,,,,"1,000�l�i2�������[�g��������1�l�j",��Z�w��,,
82,�V�C������,�V���J�C�}�`�R�E�G��,�R�`���߉��s�V�C��8-68,,,,,,,062031,�R�`��,�߉��s,,,,1,,1,,,,"1,000�l�i2�������[�g��������1�l�j",��Z�w��,,
83,�߉������Ԋw��,�c���I�J�W�h�E�V���K�N�G��,�R�`���߉��s���V�֒�6-34,,,,,(0235)22-6200,,062031,�R�`��,�߉��s,,,,1,,1,,,,"6,800�l�i2�������[�g��������1�l�j",��Z�w��,,
84,�Z�[�t�e�B�h���C�r���O�A�J�f�~�[�߉�,�Z�[�t�e�B�h���C�r���O�A�J�f�~�[�c���I�J,�R�`���߉��s���V�֒�11-22,,,,,(0235)22-0370,,062031,�R�`��,�߉��s,,,,1,,1,,,,"4,750�l�i2�������[�g��������1�l�j",��Z�w��,,
85,���c����,�X�i�_�R�E�G��,�R�`���߉��s���c��18-22,,,,,,,062031,�R�`��,�߉��s,,,,1,,1,,,,700�l�i2�������[�g��������1�l�j,��Z�w��,,
86,�吼������,�I�I�j�V�}�`�R�E�G��,�R�`���߉��s�吼��35-22,,,,,,,062031,�R�`��,�߉��s,,,,1,,1,,,,650�l�i2�������[�g��������1�l�j,��Z�w��,,
87,���V�֒�����,�j�V�V���T�C�}�`�R�E�G��,�R�`���߉��s���V�֒�24-1,,,,,,,062031,�R�`��,�߉��s,,,,1,,1,,,,750�l�i2�������[�g��������1�l�j,��Z�w��,,
88,�z�ړ��ʌ���,�k�m���q�K�V�h�I���R�E�G��,�R�`���߉��s���璬14-1,,,,,,,062031,�R�`��,�߉��s,,,,1,,1,,,,"1,250�l�i2�������[�g��������1�l�j",��Z�w��,,
89,�߉���������,�c���I�J�Z�C�u�R�E�G��,�R�`���߉��s���璬29-1,,,,,,,062031,�R�`��,�߉��s,,,,1,,1,,,,"10,000�l�i2�������[�g��������1�l�j",��Z�w��,,
90,�֓��쌴������,�T�C�g�E�K�����R�E�~���J��,�R�`���߉��s�֓��쌴���і�75,,,,,,,062031,�R�`��,�߉��s,,,,1,,1,,,,450�l�i2�������[�g��������1�l�j,��,,
91,�������𗬃Z���^�[,�V���E�t�N�W�R�E�����E�Z���^�[,�R�`���߉��s������������378,,,,,,,062031,�R�`��,�߉��s,,,,1,,1,,,,750�l�i2�������[�g��������1�l�j,��,,
92,��V�ь�����,�K���E�o���V�R�E�~���J��,�R�`���߉��s��V�ю����쌴13-1,,,,,,,062031,�R�`��,�߉��s,,,,1,,1,,,,700�l�i2�������[�g��������1�l�j,��,,
93,�O����������,�g�m�W�}�R�E�~���J��,�R�`���߉��s�O���������_�쌴62-8,,,,,,,062031,�R�`��,�߉��s,,,,1,,1,,,,800�l�i2�������[�g��������1�l�j,��,,
94,���ꌴ������,�I�K�����R�E�~���J��,�R�`���߉��s���ꌴ�����ԁX8,,,,,,,062031,�R�`��,�߉��s,,,,1,,1,,,,"1,000�l�i2�������[�g��������1�l�j",��,,
95,���c����������,���c�R�E���R�E�~���J��,�R�`���߉��s���c�������y����43,,,,,,,062031,�R�`��,�߉��s,,,,1,,1,,,,250�l�i2�������[�g��������1�l�j,��,,
96,�ɐ�����������,�C�Z���R�E�`�R�E�~���J��,�R�`���߉��s�ɐ��������ɐ���59-1,,,,,,,062031,�R�`��,�߉��s,,,,1,,1,,,,500�l�i2�������[�g��������1�l�j,��,,
97,�������w�Z�O���E���h,�R�K�l�V���E�K�b�R�E�O���E���h,�R�`���߉��s�������k��48,,,,,(0235)22-5742,,062031,�R�`��,�߉��s,,1,,1,,1,,,1,"4,420�l�i2�������[�g��������1�l�j",����,,
98,���W���L��,�^�L�U���V���E���N�q���o,�R�`���߉��s��򎚑���6-1,,,,,,,062031,�R�`��,�߉��s,,1,,1,,1,,,,560�l�i2�������[�g��������1�l�j,����,,
99,��R�J�����ّO�L��,�J�~���}���R�E�~���J���}�G�q���o,�R�`���߉��s��R�J�����K82,,,,,,,062031,�R�`��,�߉��s,,,,1,,1,,,,120�l�i2�������[�g��������1�l�j,����,,
100,���J������,�J�i���R�E�~���J��,�R�`���߉��s���J���102-1,,,,,,,062031,�R�`��,�߉��s,,1,,,,,,,,49�l�i2�������[�g��������1�l�j,����,,
101,�����F������O,�A�x�q�R�X�P�V�^�N�}�G,�R�`���߉��s�R�J���O��40,,,,,,,062031,�R�`��,�߉��s,,1,,,,,,,,55�l�i2�������[�g��������1�l�j,����,,
102,�J��암�_������,�^�j�T�_�i���u�m�E�\���R�E�G��,�R�`���߉��s�J�莚�{��34-1,,,,,,,062031,�R�`��,�߉��s,,,,1,,1,,,,"1,725�l�i2�������[�g��������1�l�j",����,,
103,���W���L��,�R�g�u�L�V���E���N�q���o,�R�`���߉��s�������216-1,,,,,,,062031,�R�`��,�߉��s,,,,1,,1,,,,250�l�i2�������[�g��������1�l�j,����,,
104,�����W���L��,�i�J�n�V�V���E���N�q���o,�R�`���߉��s����������286,,,,,,,062031,�R�`��,�߉��s,,,,1,,1,,,,15�l�i2�������[�g��������1�l�j,����,,
105,���c�W���L��,�~���f���V���E���N�q���o,�R�`���߉��s���c���\��O184-1,,,,,,,062031,�R�`��,�߉��s,,,,1,,1,,,,495�l�i2�������[�g��������1�l�j,����,,
106,����W���L��,�^�J�T�J�V���E���N�q���o,�R�`���߉��s���⎚�R��42,,,,,,,062031,�R�`��,�߉��s,,,,1,,1,,,,"1,200�l�i2�������[�g��������1�l�j",����,,
107,���߉��a�@�O���E���h,�L���E�c���I�J�r���E�C���O���E���h,�R�`���߉��s���⎚����28,,,,,,,062031,�R�`��,�߉��s,,1,,1,,1,,,,"3,800�l�i2�������[�g��������1�l�j",����,,
108,�Z�u���C���u�����ԏ�,�Z�u���C���u���`���E�V���W���E,�R�`���߉��s���⎚�V����215?5,,,,,,,062031,�R�`��,�߉��s,,1,,,,,,,,"1,214�l�i2�������[�g��������1�l�j",����,,
109,�i�`���񂫊ّO�L��,�i�`�Q���L�J���}�G�q���o,�R�`���߉��s����������34�]1,,,,,(0235)29-7725,,062031,�R�`��,�߉��s,,1,,,,,,,,530�l�i2�������[�g��������1�l�j,����,,
110,�J��\�����P�Z���^�[,�^�j�T�_�R�E�]�E�J�C�[���Z���^�[,�R�`���߉��s�J��{��18-1,,,,,,,062031,�R�`��,�߉��s,,1,,,,,,,,137�l�i2�������[�g��������1�l�j,����,,
111,�J�萶�����P�Z���^�[,�^�j�T�_�Z�C�J�c�J�C�[���Z���^�[,�R�`���߉��s�J�莚�ɐ���140-4,,,,,,,062031,�R�`��,�߉��s,,1,,,,,,,,270�l�i2�������[�g��������1�l�j,����,,
112,�|���v����,�|���v�R��,�R�`���߉��s�J�莚�͌��c17-2,,,,,,,062031,�R�`��,�߉��s,,1,,,,,,,,15�l�i2�������[�g��������1�l�j,����,,
113,�Y�� �ɐ���,�T���`���N �C�Z�h�E,�R�`���߉��s�J�莚�ɐ���133,,,,,,,062031,�R�`��,�߉��s,,1,,,,,,,,785�l�i2�������[�g��������1�l�j,����,,
114,���ؒc�n,�L���E�u�^�_���`,�R�`���߉��s�J�莚�{��84,,,,,,,062031,�R�`��,�߉��s,,1,,,,,,,,"1,500�l�i2�������[�g��������1�l�j",����,,
115,���c�����,���^�K���R�E�G��,�R�`���߉��s���c�쎚���c81-20,,,,,,,062031,�R�`��,�߉��s,,1,,1,,1,,,,"1,750�l�i2�������[�g��������1�l�j",���c��,,
116,�{����,���E�Q���W,�R�`���߉��s����53,,,,,,,062031,�R�`��,�߉��s,,1,,,,,,,,259�l�i2�������[�g��������1�l�j,���c��,,
117,����h�ЃZ���^�[,�t�W�T���{�E�T�C�Z���^�[,�R�`���߉��s���򓌑�,,,,,,,062031,�R�`��,�߉��s,,1,,,,,,,,10�l�i2�������[�g��������1�l�j,���c��,,
118,���c�쉷��L�����ԏ�,���^�K���I���Z�����E�����E�`���E�V���W���E,�R�`���߉��s���c�쎚���c4-1,,,,,,,062031,�R�`��,�߉��s,,,,1,,1,,,,415�l�i2�������[�g��������1�l�j,���c��,,
119,���c�엷�ً������ԏ�,���^�K�������J���L���E�h�E�`���E�V���W���E,�R�`���߉��s���c�쎚���c7-9,,,,,,,062031,�R�`��,�߉��s,,,,1,,1,,,,"1,900�l�i2�������[�g��������1�l�j",���c��,,
120,�����c�쏬�w�Z�O���E���h,�L���E���^�K���V���E�K�b�R�E�O���E���h,�R�`���߉��s���c�쎚���N��149-2,,,,,,,062031,�R�`��,�߉��s,,,,1,,1,,,,"5,000�l�i2�������[�g��������1�l�j",���c��,,
121,���R�W���Z���^�[,�V�����}�V���E���N�Z���^�[,�R�`���߉��s���R������46-1,,,,,,,062031,�R�`��,�߉��s,,,,1,,1,,,,435�l�i2�������[�g��������1�l�j,���,,
122,��y�������P�Z���^�[,���o�Z�Z�C�J�c�J�C�[���Z���^�[,�R�`���߉��s��y�����y655,,,,,,,062031,�R�`��,�߉��s,,,,1,,1,,,,700�l�i2�������[�g��������1�l�j,���,,
123,�R�c������,���}�_�R�E�~���J��,�R�`���߉��s�R�c������70-4,,,,,,,062031,�R�`��,�߉��s,,,,1,,1,,,,100�l�i2�������[�g��������1�l�j,���,,
124,�z�ڌ�����,�k�m���R�E�~���J��,�R�`���߉��s�z�ڎ�����27-2,,,,,,,062031,�R�`��,�߉��s,,,,1,,1,,,,245�l�i2�������[�g��������1�l�j,���,,
125,�嗄��𗬃Z���^�[,�I�I���h�J���R�E�����E�Z���^�[,�R�`���߉��s�嗄�쎚���c�T,,,,,,,062031,�R�`��,�߉��s,,,,1,,1,,,,145�l�i2�������[�g��������1�l�j,���,,
126,������W���Z���^�[,�R���h�J���V���E���N�Z���^�[,�R�`���߉��s�����쎚�F�c5-1,,,,,,,062031,�R�`��,�߉��s,,,,1,,1,,,,270�l�i2�������[�g��������1�l�j,���,,
127,���c�W���Z���^�[,�e���_�V���E���N�Z���^�[,�R�`���߉��s���c����c95,,,,,,,062031,�R�`��,�߉��s,,,,1,,1,,,,685�l�i2�������[�g��������1�l�j,���,,
128,�䉪������,�C�I�J�R�E�~���J��,�R�`���߉��s�䉪���a�c425-429,,,,,,,062031,�R�`��,�߉��s,,1,,1,,1,,,,345�l�i2�������[�g��������1�l�j,���,,
129,���R�����ّO,�I�J���}�R�E�~���J���}�G,�R�`���߉��s���R���Z��140-2,,,,,,,062031,�R�`��,�߉��s,,1,,1,,1,,,,215�l�i2�������[�g��������1�l�j,���,,
130,�|���v����,�|���v�R��,�R�`���߉��s�㐴���������O352,,,,,,,062031,�R�`��,�߉��s,,1,,,,,,,,64�l�i2�������[�g��������1�l�j,���,,
131,�X�Ќ�����,�����J�^�R�E�~���J��,�R�`���߉��s�X�Ў��O�c60-12,,,,,,,062031,�R�`��,�߉��s,,,,1,,1,,,,200�l�i2�������[�g��������1�l�j,���,,
132,�㐴��������,�J�~�V�~�Y�R�E�~���J��,�R�`���߉��s�㐴���������O354,,,,,,,062031,�R�`��,�߉��s,,,,1,,1,,,,220�l�i2�������[�g��������1�l�j,���,,
133,�������W���Z���^�[,�i�J�V�~�Y�V���E���N�Z���^�[,�R�`���߉��s�����������c62-3,,,,,,,062031,�R�`��,�߉��s,,1,,1,,1,,,,275�l�i2�������[�g��������1�l�j,���,,
134,������������,�V���V�~�Y�R�E�~���J��,�R�`���߉��s�����������c��72-36,,,,,,,062031,�R�`��,�߉��s,,1,,1,,1,,,,515�l�i2�������[�g��������1�l�j,���,,
135,�ɓ���Ə�,�C�g�E�T�M���E�W��,�R�`���߉��s�X�Ў��n��,,,,,,,062031,�R�`��,�߉��s,,1,,,,,,,,233�l�i2�������[�g��������1�l�j,���,,
136,�y���Ə�,�h�C�T�M���E�W��,�R�`���߉��s�X�Ў��n��,,,,,,,062031,�R�`��,�߉��s,,1,,,,,,,,133�l�i2�������[�g��������1�l�j,���,,
137,�����V�c������,�V�~�Y�V���f���R�E�~���J��,�R�`���߉��s�����V�c����c264-1,,,,,,,062031,�R�`��,�߉��s,,,,1,,1,,,,455�l�i2�������[�g��������1�l�j,���,,
138,�߉��H�ƍ������w�Z�O���E���h,�c���I�J�R�E�M���E�R�E�g�E�Z�������K�b�R�E�O���E���h,�R�`���߉��s�䉪����c104,,,,,(0235)25-9022,,062031,�R�`��,�߉��s,,,,1,,1,,,1,"10,000�l�i2�������[�g��������1�l�j",���,,
139,���c�����ٍL��,�^�J�_�R�E�~���J���q���o,�R�`���߉��s���c���㑺54�|2,,,,,,,062031,�R�`��,�߉��s,,,,1,,1,,,,175�l�i2�������[�g��������1�l�j,���c,,
140,���c���w�Z�O���E���h,�L���E�f���V���E�K�b�R�E�O���E���h,�R�`���߉��s���c������104-1,,,,,(0235)22-0763,,062031,�R�`��,�߉��s,,,,1,,1,,,1,"3,150�l�i2�������[�g��������1�l�j",���c,,
141,�k���c�����ٍL��,�L�^�L���E�f���R�E�~���J���q���o,�R�`���߉��s�k���c���l���c102,,,,,,,062031,�R�`��,�߉��s,,,,1,,1,,,,375�l�i2�������[�g��������1�l�j,���c,,
142,�o�ݎ������ٍL��,�J�N�K���W�R�E�~���J���q���o,�R�`���߉��s�o�ݎ�������71�|7,,,,,,,062031,�R�`��,�߉��s,,,,1,,1,,,,75�l�i2�������[�g��������1�l�j,���c,,
143,�����Βn,�`���E�I�E�����N�`,�R�`���߉��s�r�䋞�c���r�c263-60,,,,,,,062031,�R�`��,�߉��s,,,,1,,1,,,,800�l�i2�������[�g��������1�l�j,���c,,
144,�r�䋞�c�����ٍL��,�A���C�L���E�f���R�E�~���J���q���o,�R�`���߉��s�r�䋞�c���r�c137�|1,,,,,,,062031,�R�`��,�߉��s,,,,1,,1,,,,175�l�i2�������[�g��������1�l�j,���c,,
145,���r�䋞�c�V���n,�V���A���C�L���E�f�����E�G���`,�R�`���߉��s�r�䋞�c���k�c168,,,,,,,062031,�R�`��,�߉��s,,,,1,,1,,,,75�l�i2�������[�g��������1�l�j,���c,,
146,���c�����ٍL��,�t�N�_�R�E�~���J���q���o,�R�`���߉��s���c���Ɠc63�|2,,,,,,,062031,�R�`��,�߉��s,,,,1,,1,,,,450�l�i2�������[�g��������1�l�j,���c,,
147,������א_�Ћ���,�A�x�C�i���W���W���P�C�_�C,�R�`���߉��s���c������27-1,,,,,,,062031,�R�`��,�߉��s,,,,1,,1,,,,250�l�i2�������[�g��������1�l�j,���c,,
148,�L�c�����ٍL��,�g���_�R�E�~���J���q���o,�R�`���߉��s�L�c������55,,,,,,,062031,�R�`��,�߉��s,,,,1,,1,,,,375�l�i2�������[�g��������1�l�j,���c,,
149,�э�����ٍL��,�n���V�U�L�R�E�~���J���q���o,�R�`���߉��s�э莚����39,,,,,,,062031,�R�`��,�߉��s,,,,1,,1,,,,425�l�i2�������[�g��������1�l�j,���c,,
150,���O�����ٍL��,�A���^���R�E�~���J���q���o,�R�`���߉��s���O���R�m��153,,,,,,,062031,�R�`��,�߉��s,,,,1,,1,,,,250�l�i2�������[�g��������1�l�j,���c,,
151,�����_�Ћ���,�A�^�S�W���W���P�C�_�C,�R�`���߉��s���싞�c�����176,,,,,,,062031,�R�`��,�߉��s,,,,1,,1,,,,"1,500�l�i2�������[�g��������1�l�j",���c,,
152,���싞�c�����ٍL��,�i�J�m�L���E�f���R�E�~���J���q���o,�R�`���߉��s���싞�c�����31,,,,,,,062031,�R�`��,�߉��s,,,,1,,1,,,,150�l�i2�������[�g��������1�l�j,���c,,
153,�����싞�c�������e,�V���i�J�m�L���E�f���`���X�C�\�E���L,�R�`���߉��s���싞�c������33-1,,,,,,,062031,�R�`��,�߉��s,,,,1,,1,,,,100�l�i2�������[�g��������1�l�j,���c,,
154,�Ђ܂�����,�q�}�����R�E�G��,�R�`���߉��s�����c�����~��33-2,,,,,,,062031,�R�`��,�߉��s,,,,1,,1,,,,400�l�i2�������[�g��������1�l�j,���c,,
155,�����c�L��,�j�V�L���E�f���q���o,�R�`���߉��s�����c���O�c320,,,,,,,062031,�R�`��,�߉��s,,,,1,,1,,,,245�l�i2�������[�g��������1�l�j,���c,,
156,�{�c�����ّO,�z���f���R�E�~���J���}�G,�R�`���߉��s�{�c�����S�n198,,,,,,,062031,�R�`��,�߉��s,,,,1,,1,,,,100�l�i2�������[�g��������1�l�j,�h,,
157,�����c�����ّO,�R�L���E�f���R�E�~���J���}�G,�R�`���߉��s�����c�����H47-3,,,,,,,062031,�R�`��,�߉��s,,,,1,,1,,,,100�l�i2�������[�g��������1�l�j,�h,,
158,�쒆�L��,�m�i�J�q���o,�R�`���߉��s�d�����쒆89,,,,,,,062031,�R�`��,�߉��s,,,,1,,1,,,,130�l�i2�������[�g��������1�l�j,�h,,
159,���h���O�����h,�L���E�T�J�G�V���E�O�����h,�R�`���߉��s�d�����ᏼ51-1,,,,,,,062031,�R�`��,�߉��s,,,,1,,1,,,1,"3,850�l�i2�������[�g��������1�l�j",�h,,
160,���c�L��,�q���^�q���o,�R�`���߉��s���c������53-1,,,,,,,062031,�R�`��,�߉��s,,,,1,,1,,,,375�l�i2�������[�g��������1�l�j,�h,,
161,�����c�L��,�i�J�L���E�f���q���o,�R�`���߉��s�����c�����v�̍�206-1,,,,,,,062031,�R�`��,�߉��s,,,,1,,1,,,,700�l�i2�������[�g��������1�l�j,�h,,